Login
User Name:

Password:



Register
Forgot your password?
Vote for Us!
AFKMud 2.2.2
Mar 3, 2019 5:35 pm
By Samson
Development
Nov 28, 2018 12:10 pm
By Keirath
First Immortal
Oct 12, 2018 2:02 pm
By GatewaySysop
Bug in do_climb( )
Jun 5, 2018 7:31 pm
By joeyfogas
question on overland code
May 31, 2018 12:03 pm
By joeyfogas
SmaugFUSS 1.9.3
Author: Various
Submitted by: Samson
AFKMud 2.2.2
Author: AFKMud Team
Submitted by: Samson
tintin++ ogg sound player script for linux
Author: Robert Smith
Submitted by: Vladaar
6Dragons ogg Soundpack
Author: Vladaar
Submitted by: Vladaar
6Dragons 4.4
Author: Vladaar
Submitted by: Vladaar
Users Online
CommonCrawl, Bing

Members: 0
Guests: 12
Stats
Files
Topics
Posts
Members
Newest Member
483
3,743
19,401
655
RodrickMci
Today's Birthdays
tphegley (37)
Related Links
» SmaugMuds » Codebases » AFKMud Support & Development » AFK compile error
Forum Rules | Mark all | Recent Posts

AFK compile error
< Newer Topic :: Older Topic >

Pages:<< prev 1 next >>
Post is unread #1 May 7, 2015 5:43 am
Go to the top of the page
Go to the bottom of the page

ardentcrest
Fledgling
GroupMembers
Posts16
JoinedNov 27, 2014

Trying to compile latest AFK. getting this error
$ make
Building AFKMud....
make -j2 -s afkmud
Compiling o/imc.o....
Compiling o/act_info.o....
imc.cpp: In function ‘void imc_loop()’:
imc.cpp:2568:78: error: ‘select’ was not declared in this scope
if( select( this_imcmud->desc + 1, &in_set, &out_set, nullptr, &null_time ) < 0 )
^
Makefile:172: recipe for target 'o/imc.o' failed
make[1]: *** [o/imc.o] Error 1
make[1]: *** Waiting for unfinished jobs....
Makefile:109: recipe for target 'all' failed
make: *** [all] Error 2


any help. Smaugfuss compiles ok
       
Pages:<< prev 1 next >>